<feed xmlns='http://www.w3.org/2005/Atom'>
<title>kernel.git/tools/testing/selftests/bpf/progs, branch linux-5.10.y</title>
<subtitle>Hosts the 0x221E linux distro kernel.
</subtitle>
<id>https://git.0xinfinity.dev/distro/kernel.git/atom?h=linux-5.10.y</id>
<link rel='self' href='https://git.0xinfinity.dev/distro/kernel.git/atom?h=linux-5.10.y'/>
<link rel='alternate' type='text/html' href='https://git.0xinfinity.dev/distro/kernel.git/'/>
<updated>2026-01-19T12:11:33Z</updated>
<entry>
<title>selftests/bpf: Improve reliability of test_perf_branches_no_hw()</title>
<updated>2026-01-19T12:11:33Z</updated>
<author>
<name>Matt Bobrowski</name>
</author>
<published>2025-11-19T14:35:40Z</published>
<link rel='alternate' type='text/html' href='https://git.0xinfinity.dev/distro/kernel.git/commit/?id=8f5d073be1b6334ae9ac52a08b72e00cab0904bd'/>
<id>urn:sha1:8f5d073be1b6334ae9ac52a08b72e00cab0904bd</id>
<content type='text'>
[ Upstream commit ae24fc8a16b0481ea8c5acbc66453c49ec0431c4 ]

Currently, test_perf_branches_no_hw() relies on the busy loop within
test_perf_branches_common() being slow enough to allow at least one
perf event sample tick to occur before starting to tear down the
backing perf event BPF program. With a relatively small fixed
iteration count of 1,000,000, this is not guaranteed on modern fast
CPUs, resulting in the test run to subsequently fail with the
following:

bpf_testmod.ko is already unloaded.
Loading bpf_testmod.ko...
Successfully loaded bpf_testmod.ko.
test_perf_branches_common:PASS:test_perf_branches_load 0 nsec
test_perf_branches_common:PASS:attach_perf_event 0 nsec
test_perf_branches_common:PASS:set_affinity 0 nsec
check_good_sample:PASS:output not valid 0 nsec
check_good_sample:PASS:read_branches_size 0 nsec
check_good_sample:PASS:read_branches_stack 0 nsec
check_good_sample:PASS:read_branches_stack 0 nsec
check_good_sample:PASS:read_branches_global 0 nsec
check_good_sample:PASS:read_branches_global 0 nsec
check_good_sample:PASS:read_branches_size 0 nsec
test_perf_branches_no_hw:PASS:perf_event_open 0 nsec
test_perf_branches_common:PASS:test_perf_branches_load 0 nsec
test_perf_branches_common:PASS:attach_perf_event 0 nsec
test_perf_branches_common:PASS:set_affinity 0 nsec
check_bad_sample:FAIL:output not valid no valid sample from prog
Summary: 0/1 PASSED, 0 SKIPPED, 1 FAILED
Successfully unloaded bpf_testmod.ko.

On a modern CPU (i.e. one with a 3.5 GHz clock rate), executing 1
million increments of a volatile integer can take significantly less
than 1 millisecond. If the spin loop and detachment of the perf event
BPF program elapses before the first 1 ms sampling interval elapses,
the perf event will never end up firing. Fix this by bumping the loop
iteration counter a little within test_perf_branches_common(), along
with ensuring adding another loop termination condition which is
directly influenced by the backing perf event BPF program
executing. Notably, a concious decision was made to not adjust the
sample_freq value as that is just not a reliable way to go about
fixing the problem. It effectively still leaves the race window open.

Fixes: 67306f84ca78c ("selftests/bpf: Add bpf_read_branch_records() selftest")
Signed-off-by: Matt Bobrowski &lt;mattbobrowski@google.com&gt;
Reviewed-by: Jiri Olsa &lt;jolsa@kernel.org&gt;
Link: https://lore.kernel.org/r/20251119143540.2911424-1-mattbobrowski@google.com
Signed-off-by: Alexei Starovoitov &lt;ast@kernel.org&gt;
Signed-off-by: Sasha Levin &lt;sashal@kernel.org&gt;
</content>
</entry>
<entry>
<title>selftests/bpf: Fix errors compiling cg_storage_multi.h with musl libc</title>
<updated>2024-10-17T13:07:49Z</updated>
<author>
<name>Tony Ambardar</name>
</author>
<published>2024-07-23T05:54:46Z</published>
<link rel='alternate' type='text/html' href='https://git.0xinfinity.dev/distro/kernel.git/commit/?id=c2db6acd8cc36204e02fefb6d051c38c3528d437'/>
<id>urn:sha1:c2db6acd8cc36204e02fefb6d051c38c3528d437</id>
<content type='text'>
[ Upstream commit 730561d3c08d4a327cceaabf11365958a1c00cec ]

Remove a redundant include of '&lt;asm/types.h&gt;', whose needed definitions are
already included (via '&lt;linux/types.h&gt;') in cg_storage_multi_egress_only.c,
cg_storage_multi_isolated.c, and cg_storage_multi_shared.c. This avoids
redefinition errors seen compiling for mips64el/musl-libc like:

  In file included from progs/cg_storage_multi_egress_only.c:13:
  In file included from progs/cg_storage_multi.h:6:
  In file included from /usr/mips64el-linux-gnuabi64/include/asm/types.h:23:
  /usr/include/asm-generic/int-l64.h:29:25: error: typedef redefinition with different types ('long' vs 'long long')
     29 | typedef __signed__ long __s64;
        |                         ^
  /usr/include/asm-generic/int-ll64.h:30:44: note: previous definition is here
     30 | __extension__ typedef __signed__ long long __s64;
        |                                            ^

Fixes: 9e5bd1f7633b ("selftests/bpf: Test CGROUP_STORAGE map can't be used by multiple progs")
Signed-off-by: Tony Ambardar &lt;tony.ambardar@gmail.com&gt;
Signed-off-by: Andrii Nakryiko &lt;andrii@kernel.org&gt;
Link: https://lore.kernel.org/bpf/4f4702e9f6115b7f84fea01b2326ca24c6df7ba8.1721713597.git.tony.ambardar@gmail.com
Signed-off-by: Sasha Levin &lt;sashal@kernel.org&gt;
</content>
</entry>
<entry>
<title>libbpf: Fix no-args func prototype BTF dumping syntax</title>
<updated>2024-08-19T03:41:03Z</updated>
<author>
<name>Andrii Nakryiko</name>
</author>
<published>2024-07-12T22:44:42Z</published>
<link rel='alternate' type='text/html' href='https://git.0xinfinity.dev/distro/kernel.git/commit/?id=641b7a8920f44967184921ce5707eb180ee2cfdf'/>
<id>urn:sha1:641b7a8920f44967184921ce5707eb180ee2cfdf</id>
<content type='text'>
[ Upstream commit 189f1a976e426011e6a5588f1d3ceedf71fe2965 ]

For all these years libbpf's BTF dumper has been emitting not strictly
valid syntax for function prototypes that have no input arguments.

Instead of `int (*blah)()` we should emit `int (*blah)(void)`.

This is not normally a problem, but it manifests when we get kfuncs in
vmlinux.h that have no input arguments. Due to compiler internal
specifics, we get no BTF information for such kfuncs, if they are not
declared with proper `(void)`.

The fix is trivial. We also need to adjust a few ancient tests that
happily assumed `()` is correct.

Fixes: 351131b51c7a ("libbpf: add btf_dump API for BTF-to-C conversion")
Reported-by: Tejun Heo &lt;tj@kernel.org&gt;
Signed-off-by: Andrii Nakryiko &lt;andrii@kernel.org&gt;
Signed-off-by: Daniel Borkmann &lt;daniel@iogearbox.net&gt;
Acked-by: Stanislav Fomichev &lt;sdf@fomichev.me&gt;
Link: https://lore.kernel.org/bpf/20240712224442.282823-1-andrii@kernel.org
Signed-off-by: Sasha Levin &lt;sashal@kernel.org&gt;
</content>
</entry>
<entry>
<title>bpf: Allow reads from uninit stack</title>
<updated>2024-07-18T11:05:50Z</updated>
<author>
<name>Eduard Zingerman</name>
</author>
<published>2023-02-19T20:04:26Z</published>
<link rel='alternate' type='text/html' href='https://git.0xinfinity.dev/distro/kernel.git/commit/?id=ca42be8dd1e217273dd8e9077d4ec9117eaa0ef3'/>
<id>urn:sha1:ca42be8dd1e217273dd8e9077d4ec9117eaa0ef3</id>
<content type='text'>
commit 6715df8d5d24655b9fd368e904028112b54c7de1 upstream.

This commits updates the following functions to allow reads from
uninitialized stack locations when env-&gt;allow_uninit_stack option is
enabled:
- check_stack_read_fixed_off()
- check_stack_range_initialized(), called from:
  - check_stack_read_var_off()
  - check_helper_mem_access()

Such change allows to relax logic in stacksafe() to treat STACK_MISC
and STACK_INVALID in a same way and make the following stack slot
configurations equivalent:

  |  Cached state    |  Current state   |
  |   stack slot     |   stack slot     |
  |------------------+------------------|
  | STACK_INVALID or | STACK_INVALID or |
  | STACK_MISC       | STACK_SPILL   or |
  |                  | STACK_MISC    or |
  |                  | STACK_ZERO    or |
  |                  | STACK_DYNPTR     |

This leads to significant verification speed gains (see below).

The idea was suggested by Andrii Nakryiko [1] and initial patch was
created by Alexei Starovoitov [2].

Currently the env-&gt;allow_uninit_stack is allowed for programs loaded
by users with CAP_PERFMON or CAP_SYS_ADMIN capabilities.

A number of test cases from verifier/*.c were expecting uninitialized
stack access to be an error. These test cases were updated to execute
in unprivileged mode (thus preserving the tests).

The test progs/test_global_func10.c expected "invalid indirect read
from stack" error message because of the access to uninitialized
memory region. This error is no longer possible in privileged mode.
The test is updated to provoke an error "invalid indirect access to
stack" because of access to invalid stack address (such error is not
verified by progs/test_global_func*.c series of tests).

The following tests had to be removed because these can't be made
unprivileged:
- verifier/sock.c:
  - "sk_storage_get(map, skb-&gt;sk, &amp;stack_value, 1): partially init
  stack_value"
  BPF_PROG_TYPE_SCHED_CLS programs are not executed in unprivileged mode.
- verifier/var_off.c:
  - "indirect variable-offset stack access, max_off+size &gt; max_initialized"
  - "indirect variable-offset stack access, uninitialized"
  These tests verify that access to uninitialized stack values is
  detected when stack offset is not a constant. However, variable
  stack access is prohibited in unprivileged mode, thus these tests
  are no longer valid.

 * * *

Here is veristat log comparing this patch with current master on a
set of selftest binaries listed in tools/testing/selftests/bpf/veristat.cfg
and cilium BPF binaries (see [3]):

$ ./veristat -e file,prog,states -C -f 'states_pct&lt;-30' master.log current.log
File                        Program                     States (A)  States (B)  States    (DIFF)
--------------------------  --------------------------  ----------  ----------  ----------------
bpf_host.o                  tail_handle_ipv6_from_host         349         244    -105 (-30.09%)
bpf_host.o                  tail_handle_nat_fwd_ipv4          1320         895    -425 (-32.20%)
bpf_lxc.o                   tail_handle_nat_fwd_ipv4          1320         895    -425 (-32.20%)
bpf_sock.o                  cil_sock4_connect                   70          48     -22 (-31.43%)
bpf_sock.o                  cil_sock4_sendmsg                   68          46     -22 (-32.35%)
bpf_xdp.o                   tail_handle_nat_fwd_ipv4          1554         803    -751 (-48.33%)
bpf_xdp.o                   tail_lb_ipv4                      6457        2473   -3984 (-61.70%)
bpf_xdp.o                   tail_lb_ipv6                      7249        3908   -3341 (-46.09%)
pyperf600_bpf_loop.bpf.o    on_event                           287         145    -142 (-49.48%)
strobemeta.bpf.o            on_event                         15915        4772  -11143 (-70.02%)
strobemeta_nounroll2.bpf.o  on_event                         17087        3820  -13267 (-77.64%)
xdp_synproxy_kern.bpf.o     syncookie_tc                     21271        6635  -14636 (-68.81%)
xdp_synproxy_kern.bpf.o     syncookie_xdp                    23122        6024  -17098 (-73.95%)
--------------------------  --------------------------  ----------  ----------  ----------------

Note: I limited selection by states_pct&lt;-30%.

Inspection of differences in pyperf600_bpf_loop behavior shows that
the following patch for the test removes almost all differences:

    - a/tools/testing/selftests/bpf/progs/pyperf.h
    + b/tools/testing/selftests/bpf/progs/pyperf.h
    @ -266,8 +266,8 @ int __on_event(struct bpf_raw_tracepoint_args *ctx)
            }

            if (event-&gt;pthread_match || !pidData-&gt;use_tls) {
    -               void* frame_ptr;
    -               FrameData frame;
    +               void* frame_ptr = 0;
    +               FrameData frame = {};
                    Symbol sym = {};
                    int cur_cpu = bpf_get_smp_processor_id();

W/o this patch the difference comes from the following pattern
(for different variables):

    static bool get_frame_data(... FrameData *frame ...)
    {
        ...
        bpf_probe_read_user(&amp;frame-&gt;f_code, ...);
        if (!frame-&gt;f_code)
            return false;
        ...
        bpf_probe_read_user(&amp;frame-&gt;co_name, ...);
        if (frame-&gt;co_name)
            ...;
    }

    int __on_event(struct bpf_raw_tracepoint_args *ctx)
    {
        FrameData frame;
        ...
        get_frame_data(... &amp;frame ...) // indirectly via a bpf_loop &amp; callback
        ...
    }

    SEC("raw_tracepoint/kfree_skb")
    int on_event(struct bpf_raw_tracepoint_args* ctx)
    {
        ...
        ret |= __on_event(ctx);
        ret |= __on_event(ctx);
        ...
    }

With regards to value `frame-&gt;co_name` the following is important:
- Because of the conditional `if (!frame-&gt;f_code)` each call to
  __on_event() produces two states, one with `frame-&gt;co_name` marked
  as STACK_MISC, another with it as is (and marked STACK_INVALID on a
  first call).
- The call to bpf_probe_read_user() does not mark stack slots
  corresponding to `&amp;frame-&gt;co_name` as REG_LIVE_WRITTEN but it marks
  these slots as BPF_MISC, this happens because of the following loop
  in the check_helper_call():

	for (i = 0; i &lt; meta.access_size; i++) {
		err = check_mem_access(env, insn_idx, meta.regno, i, BPF_B,
				       BPF_WRITE, -1, false);
		if (err)
			return err;
	}

  Note the size of the write, it is a one byte write for each byte
  touched by a helper. The BPF_B write does not lead to write marks
  for the target stack slot.
- Which means that w/o this patch when second __on_event() call is
  verified `if (frame-&gt;co_name)` will propagate read marks first to a
  stack slot with STACK_MISC marks and second to a stack slot with
  STACK_INVALID marks and these states would be considered different.

[1] https://lore.kernel.org/bpf/CAEf4BzY3e+ZuC6HUa8dCiUovQRg2SzEk7M-dSkqNZyn=xEmnPA@mail.gmail.com/
[2] https://lore.kernel.org/bpf/CAADnVQKs2i1iuZ5SUGuJtxWVfGYR9kDgYKhq3rNV+kBLQCu7rA@mail.gmail.com/
[3] git@github.com:anakryiko/cilium.git

Suggested-by: Andrii Nakryiko &lt;andrii@kernel.org&gt;
Co-developed-by: Alexei Starovoitov &lt;ast@kernel.org&gt;
Signed-off-by: Eduard Zingerman &lt;eddyz87@gmail.com&gt;
Acked-by: Andrii Nakryiko &lt;andrii@kernel.org&gt;
Link: https://lore.kernel.org/r/20230219200427.606541-2-eddyz87@gmail.com
Signed-off-by: Alexei Starovoitov &lt;ast@kernel.org&gt;
Signed-off-by: Maxim Mikityanskiy &lt;maxim@isovalent.com&gt;
Signed-off-by: Greg Kroah-Hartman &lt;gregkh@linuxfoundation.org&gt;
</content>
</entry>
<entry>
<title>selftests/bpf: Fix pyperf180 compilation failure with clang18</title>
<updated>2024-02-23T07:42:06Z</updated>
<author>
<name>Yonghong Song</name>
</author>
<published>2023-11-10T19:36:44Z</published>
<link rel='alternate' type='text/html' href='https://git.0xinfinity.dev/distro/kernel.git/commit/?id=9b9bbba16be48de15cc468ed930e0c59bb5e5d93'/>
<id>urn:sha1:9b9bbba16be48de15cc468ed930e0c59bb5e5d93</id>
<content type='text'>
[ Upstream commit 100888fb6d8a185866b1520031ee7e3182b173de ]

With latest clang18 (main branch of llvm-project repo), when building bpf selftests,
    [~/work/bpf-next (master)]$ make -C tools/testing/selftests/bpf LLVM=1 -j

The following compilation error happens:
    fatal error: error in backend: Branch target out of insn range
    ...
    Stack dump:
    0.      Program arguments: clang -g -Wall -Werror -D__TARGET_ARCH_x86 -mlittle-endian
      -I/home/yhs/work/bpf-next/tools/testing/selftests/bpf/tools/include
      -I/home/yhs/work/bpf-next/tools/testing/selftests/bpf -I/home/yhs/work/bpf-next/tools/include/uapi
      -I/home/yhs/work/bpf-next/tools/testing/selftests/usr/include -idirafter
      /home/yhs/work/llvm-project/llvm/build.18/install/lib/clang/18/include -idirafter /usr/local/include
      -idirafter /usr/include -Wno-compare-distinct-pointer-types -DENABLE_ATOMICS_TESTS -O2 --target=bpf
      -c progs/pyperf180.c -mcpu=v3 -o /home/yhs/work/bpf-next/tools/testing/selftests/bpf/pyperf180.bpf.o
    1.      &lt;eof&gt; parser at end of file
    2.      Code generation
    ...

The compilation failure only happens to cpu=v2 and cpu=v3. cpu=v4 is okay
since cpu=v4 supports 32-bit branch target offset.

The above failure is due to upstream llvm patch [1] where some inlining behavior
are changed in clang18.

To workaround the issue, previously all 180 loop iterations are fully unrolled.
The bpf macro __BPF_CPU_VERSION__ (implemented in clang18 recently) is used to avoid
unrolling changes if cpu=v4. If __BPF_CPU_VERSION__ is not available and the
compiler is clang18, the unrollng amount is unconditionally reduced.

  [1] https://github.com/llvm/llvm-project/commit/1a2e77cf9e11dbf56b5720c607313a566eebb16e

Signed-off-by: Yonghong Song &lt;yonghong.song@linux.dev&gt;
Signed-off-by: Andrii Nakryiko &lt;andrii@kernel.org&gt;
Tested-by: Alan Maguire &lt;alan.maguire@oracle.com&gt;
Link: https://lore.kernel.org/bpf/20231110193644.3130906-1-yonghong.song@linux.dev
Signed-off-by: Sasha Levin &lt;sashal@kernel.org&gt;
</content>
</entry>
<entry>
<title>selftests/bpf: fix static assert compilation issue for test_cls_*.c</title>
<updated>2023-09-19T10:20:08Z</updated>
<author>
<name>Alan Maguire</name>
</author>
<published>2023-08-02T07:39:06Z</published>
<link rel='alternate' type='text/html' href='https://git.0xinfinity.dev/distro/kernel.git/commit/?id=323084d77d1f4de1d2228df3a89a7eb331fbb150'/>
<id>urn:sha1:323084d77d1f4de1d2228df3a89a7eb331fbb150</id>
<content type='text'>
[ Upstream commit 416c6d01244ecbf0abfdb898fd091b50ef951b48 ]

commit bdeeed3498c7 ("libbpf: fix offsetof() and container_of() to work with CO-RE")

...was backported to stable trees such as 5.15. The problem is that with older
LLVM/clang (14/15) - which is often used for older kernels - we see compilation
failures in BPF selftests now:

In file included from progs/test_cls_redirect_subprogs.c:2:
progs/test_cls_redirect.c:90:2: error: static assertion expression is not an integral constant expression
        sizeof(flow_ports_t) !=
        ^~~~~~~~~~~~~~~~~~~~~~~
progs/test_cls_redirect.c:91:3: note: cast that performs the conversions of a reinterpret_cast is not allowed in a constant expression
                offsetofend(struct bpf_sock_tuple, ipv4.dport) -
                ^
progs/test_cls_redirect.c:32:3: note: expanded from macro 'offsetofend'
        (offsetof(TYPE, MEMBER) + sizeof((((TYPE *)0)-&gt;MEMBER)))
         ^
tools/testing/selftests/bpf/tools/include/bpf/bpf_helpers.h:86:33: note: expanded from macro 'offsetof'
                                 ^
In file included from progs/test_cls_redirect_subprogs.c:2:
progs/test_cls_redirect.c:95:2: error: static assertion expression is not an integral constant expression
        sizeof(flow_ports_t) !=
        ^~~~~~~~~~~~~~~~~~~~~~~
progs/test_cls_redirect.c:96:3: note: cast that performs the conversions of a reinterpret_cast is not allowed in a constant expression
                offsetofend(struct bpf_sock_tuple, ipv6.dport) -
                ^
progs/test_cls_redirect.c:32:3: note: expanded from macro 'offsetofend'
        (offsetof(TYPE, MEMBER) + sizeof((((TYPE *)0)-&gt;MEMBER)))
         ^
tools/testing/selftests/bpf/tools/include/bpf/bpf_helpers.h:86:33: note: expanded from macro 'offsetof'
                                 ^
2 errors generated.
make: *** [Makefile:594: tools/testing/selftests/bpf/test_cls_redirect_subprogs.bpf.o] Error 1

The problem is the new offsetof() does not play nice with static asserts.
Given that the context is a static assert (and CO-RE relocation is not
needed at compile time), offsetof() usage can be replaced by restoring
the original offsetof() definition as __builtin_offsetof().

Fixes: bdeeed3498c7 ("libbpf: fix offsetof() and container_of() to work with CO-RE")
Reported-by: Colm Harrington &lt;colm.harrington@oracle.com&gt;
Signed-off-by: Alan Maguire &lt;alan.maguire@oracle.com&gt;
Tested-by: Yipeng Zou &lt;zouyipeng@huawei.com&gt;
Acked-by: Yonghong Song &lt;yonghong.song@linux.dev&gt;
Link: https://lore.kernel.org/r/20230802073906.3197480-1-alan.maguire@oracle.com
Signed-off-by: Alexei Starovoitov &lt;ast@kernel.org&gt;
Signed-off-by: Sasha Levin &lt;sashal@kernel.org&gt;
</content>
</entry>
<entry>
<title>selftests/bpf: Fix sk_assign on s390x</title>
<updated>2023-08-16T16:20:59Z</updated>
<author>
<name>Ilya Leoshkevich</name>
</author>
<published>2023-08-04T15:24:51Z</published>
<link rel='alternate' type='text/html' href='https://git.0xinfinity.dev/distro/kernel.git/commit/?id=7328c5319e0847574bb7561e3e2aa27d3b3abd4c'/>
<id>urn:sha1:7328c5319e0847574bb7561e3e2aa27d3b3abd4c</id>
<content type='text'>
[ Upstream commit 7ce878ca81bca7811e669db4c394b86780e0dbe4 ]

sk_assign is failing on an s390x machine running Debian "bookworm" for
2 reasons: legacy server_map definition and uninitialized addrlen in
recvfrom() call.

Fix by adding a new-style server_map definition and dropping addrlen
(recvfrom() allows NULL values for src_addr and addrlen).

Since the test should support tc built without libbpf, build the prog
twice: with the old-style definition and with the new-style definition,
then select the right one at runtime. This could be done at compile
time too, but this would not be cross-compilation friendly.

Signed-off-by: Ilya Leoshkevich &lt;iii@linux.ibm.com&gt;
Link: https://lore.kernel.org/r/20230129190501.1624747-2-iii@linux.ibm.com
Signed-off-by: Alexei Starovoitov &lt;ast@kernel.org&gt;
Signed-off-by: Pu Lehui &lt;pulehui@huawei.com&gt;
Tested-by: Luiz Capitulino &lt;luizcap@amazon.com&gt;
Signed-off-by: Greg Kroah-Hartman &lt;gregkh@linuxfoundation.org&gt;
</content>
</entry>
<entry>
<title>selftests/bpf: Workaround verification failure for fexit_bpf2bpf/func_replace_return_code</title>
<updated>2023-08-16T16:20:59Z</updated>
<author>
<name>Yonghong Song</name>
</author>
<published>2023-08-04T15:24:50Z</published>
<link rel='alternate' type='text/html' href='https://git.0xinfinity.dev/distro/kernel.git/commit/?id=b1a3e27d6bfcb1db7b06e83377397638db7f2286'/>
<id>urn:sha1:b1a3e27d6bfcb1db7b06e83377397638db7f2286</id>
<content type='text'>
[ Upstream commit 63d78b7e8ca2d0eb8c687a355fa19d01b6fcc723 ]

With latest llvm17, selftest fexit_bpf2bpf/func_replace_return_code
has the following verification failure:

  0: R1=ctx(off=0,imm=0) R10=fp0
  ; int connect_v4_prog(struct bpf_sock_addr *ctx)
  0: (bf) r7 = r1                       ; R1=ctx(off=0,imm=0) R7_w=ctx(off=0,imm=0)
  1: (b4) w6 = 0                        ; R6_w=0
  ; memset(&amp;tuple.ipv4.saddr, 0, sizeof(tuple.ipv4.saddr));
  ...
  ; return do_bind(ctx) ? 1 : 0;
  179: (bf) r1 = r7                     ; R1=ctx(off=0,imm=0) R7=ctx(off=0,imm=0)
  180: (85) call pc+147
  Func#3 is global and valid. Skipping.
  181: R0_w=scalar()
  181: (bc) w6 = w0                     ; R0_w=scalar() R6_w=scalar(umax=4294967295,var_off=(0x0; 0xffffffff))
  182: (05) goto pc-129
  ; }
  54: (bc) w0 = w6                      ; R0_w=scalar(umax=4294967295,var_off=(0x0; 0xffffffff)) R6_w=scalar(umax=4294967295,var_off=(0x0; 0xffffffff))
  55: (95) exit
  At program exit the register R0 has value (0x0; 0xffffffff) should have been in (0x0; 0x1)
  processed 281 insns (limit 1000000) max_states_per_insn 1 total_states 26 peak_states 26 mark_read 13
  -- END PROG LOAD LOG --
  libbpf: prog 'connect_v4_prog': failed to load: -22

The corresponding source code:

  __attribute__ ((noinline))
  int do_bind(struct bpf_sock_addr *ctx)
  {
        struct sockaddr_in sa = {};

        sa.sin_family = AF_INET;
        sa.sin_port = bpf_htons(0);
        sa.sin_addr.s_addr = bpf_htonl(SRC_REWRITE_IP4);

        if (bpf_bind(ctx, (struct sockaddr *)&amp;sa, sizeof(sa)) != 0)
                return 0;

        return 1;
  }
  ...
  SEC("cgroup/connect4")
  int connect_v4_prog(struct bpf_sock_addr *ctx)
  {
  ...
        return do_bind(ctx) ? 1 : 0;
  }

Insn 180 is a call to 'do_bind'. The call's return value is also the return value
for the program. Since do_bind() returns 0/1, so it is legitimate for compiler to
optimize 'return do_bind(ctx) ? 1 : 0' to 'return do_bind(ctx)'. However, such
optimization breaks verifier as the return value of 'do_bind()' is marked as any
scalar which violates the requirement of prog return value 0/1.

There are two ways to fix this problem, (1) changing 'return 1' in do_bind() to
e.g. 'return 10' so the compiler has to do 'do_bind(ctx) ? 1 :0', or (2)
suggested by Andrii, marking do_bind() with __weak attribute so the compiler
cannot make any assumption on do_bind() return value.

This patch adopted adding __weak approach which is simpler and more resistant
to potential compiler optimizations.

Suggested-by: Andrii Nakryiko &lt;andrii@kernel.org&gt;
Signed-off-by: Yonghong Song &lt;yhs@fb.com&gt;
Signed-off-by: Andrii Nakryiko &lt;andrii@kernel.org&gt;
Link: https://lore.kernel.org/bpf/20230310012410.2920570-1-yhs@fb.com
Signed-off-by: Pu Lehui &lt;pulehui@huawei.com&gt;
Tested-by: Luiz Capitulino &lt;luizcap@amazon.com&gt;
Signed-off-by: Greg Kroah-Hartman &lt;gregkh@linuxfoundation.org&gt;
</content>
</entry>
<entry>
<title>bpf: Remove extra lock_sock for TCP_ZEROCOPY_RECEIVE</title>
<updated>2023-07-27T06:43:37Z</updated>
<author>
<name>Stanislav Fomichev</name>
</author>
<published>2021-01-15T16:34:59Z</published>
<link rel='alternate' type='text/html' href='https://git.0xinfinity.dev/distro/kernel.git/commit/?id=08f61a34913558e06576e7b6318bf583f273c1be'/>
<id>urn:sha1:08f61a34913558e06576e7b6318bf583f273c1be</id>
<content type='text'>
[ Upstream commit 9cacf81f8161111db25f98e78a7a0e32ae142b3f ]

Add custom implementation of getsockopt hook for TCP_ZEROCOPY_RECEIVE.
We skip generic hooks for TCP_ZEROCOPY_RECEIVE and have a custom
call in do_tcp_getsockopt using the on-stack data. This removes
3% overhead for locking/unlocking the socket.

Without this patch:
     3.38%     0.07%  tcp_mmap  [kernel.kallsyms]  [k] __cgroup_bpf_run_filter_getsockopt
            |
             --3.30%--__cgroup_bpf_run_filter_getsockopt
                       |
                        --0.81%--__kmalloc

With the patch applied:
     0.52%     0.12%  tcp_mmap  [kernel.kallsyms]  [k] __cgroup_bpf_run_filter_getsockopt_kern

Note, exporting uapi/tcp.h requires removing netinet/tcp.h
from test_progs.h because those headers have confliciting
definitions.

Signed-off-by: Stanislav Fomichev &lt;sdf@google.com&gt;
Signed-off-by: Alexei Starovoitov &lt;ast@kernel.org&gt;
Acked-by: Martin KaFai Lau &lt;kafai@fb.com&gt;
Link: https://lore.kernel.org/bpf/20210115163501.805133-2-sdf@google.com
Stable-dep-of: 2598619e012c ("sctp: add bpf_bypass_getsockopt proto callback")
Signed-off-by: Sasha Levin &lt;sashal@kernel.org&gt;
</content>
</entry>
<entry>
<title>libbpf: Fix btf_dump's packed struct determination</title>
<updated>2023-04-05T09:23:52Z</updated>
<author>
<name>Andrii Nakryiko</name>
</author>
<published>2022-12-15T18:36:05Z</published>
<link rel='alternate' type='text/html' href='https://git.0xinfinity.dev/distro/kernel.git/commit/?id=b4781477f397a9e10f36d035ffc76bfb67aa1639'/>
<id>urn:sha1:b4781477f397a9e10f36d035ffc76bfb67aa1639</id>
<content type='text'>
[ Upstream commit 4fb877aaa179dcdb1676d55216482febaada457e ]

Fix bug in btf_dump's logic of determining if a given struct type is
packed or not. The notion of "natural alignment" is not needed and is
even harmful in this case, so drop it altogether. The biggest difference
in btf_is_struct_packed() compared to its original implementation is
that we don't really use btf__align_of() to determine overall alignment
of a struct type (because it could be 1 for both packed and non-packed
struct, depending on specifci field definitions), and just use field's
actual alignment to calculate whether any field is requiring packing or
struct's size overall necessitates packing.

Add two simple test cases that demonstrate the difference this change
would make.

Fixes: ea2ce1ba99aa ("libbpf: Fix BTF-to-C converter's padding logic")
Reported-by: Eduard Zingerman &lt;eddyz87@gmail.com&gt;
Signed-off-by: Andrii Nakryiko &lt;andrii@kernel.org&gt;
Signed-off-by: Daniel Borkmann &lt;daniel@iogearbox.net&gt;
Acked-by: Eduard Zingerman &lt;eddyz87@gmail.com&gt;
Link: https://lore.kernel.org/bpf/20221215183605.4149488-1-andrii@kernel.org
Signed-off-by: Sasha Levin &lt;sashal@kernel.org&gt;
</content>
</entry>
</feed>
